{"text_format":"1","workbook":"xlsx","n_sheets":13,"sheets":["|","Бланк ЗАКАЗА","Титул.лист","Столы","Шкафы","Пенал-полупеналы","Ручки","Витраж","столешницы,козырьки,багеты","доп.хар+мойки","Материалы","ФРЕЗЕРОВКИ","ПЛИНТУС KORNER"],"not_rendered":{"charts":0,"images":319,"macros":1,"external_links":0,"defined_names":6,"comments":1,"pivot_tables":0},"unopened":[],"bounds":{"document_bytes":16777216,"sheet_cells":100000,"rows_first":2000,"rows_last":500,"rows_between":2000,"halvings":0,"cell_chars":16384,"cell_head_chars":4096},"cells_cut":0,"cells_raw":0,"read":"whole","date_system":"1900"}

{"sheet":"|","index":0,"n_rows":49,"n_cols":20,"rows_kept":49,"cut":false,"hidden":false,"merged":[[13,1,13,6],[13,11,13,12],[16,1,16,6],[16,11,16,12],[3,1,3,6],[3,11,3,12],[6,1,6,6],[6,11,6,12],[9,1,9,6],[9,11,9,12],[27,1,27,6],[27,11,27,12],[31,1,31,6],[31,11,31,12],[20,1,20,6],[20,11,20,12],[23,1,23,6],[23,11,23,12],[45,1,45,6],[45,11,45,12],[48,1,48,6],[48,11,48,12],[35,1,35,6],[35,11,35,12],[39,1,39,6],[39,11,39,12],[42,1,42,6],[42,11,42,12]]}
[]
["ДОБАВИТЬ"]
[" стол по наименованию"]
["Стол","Стол под мойку 1дв., размер: 500",null,null,null,null,null,"БАГЕТНАЯ",{"$f":"IFERROR(VLOOKUP($B4,Столы!$E$3:$F$206,2,0),\"-\")","v":"1101-50"},{"$f":"IFERROR(VLOOKUP($B4,Столы!$E$2:$K$206,MATCH($H4,Столы!$E$1:$K$1,0),0)*(1+Титул.лист!$P$2),\"\")","v":3293.58},1,{"$f":"IFERROR(J4*K4,\"\")","v":3293.58},null,null,null,null,{"$f":"I4&\". \"&A4&\". \"&B4&\". \"&H4","v":"1101-50. Стол. Стол под мойку 1дв., размер: 500. БАГЕТНАЯ"},{"$f":"K4","v":1},{"$f":"J4","v":3293.58},{"$f":"L4","v":3293.58}]
["ДОБАВИТЬ"]
["стол по коду изделия"]
["Стол",{"$f":"IFERROR(INDEX(Столы!$E$3:$F$206,MATCH(I7,Столы!$F$3:$F$206,0),1),\"\")","v":""},null,null,null,null,null,null,null,{"$f":"IFERROR(VLOOKUP($B7,Столы!$E$2:$I$206,MATCH($H7,Столы!$E$1:$I$1,0),0)*(1+Титул.лист!$P$2),\"\")","v":""},1,{"$f":"IFERROR(J7*K7,\"\")","v":""},null,null,null,null,{"$f":"I7&\". \"&A7&\". \"&B7&\". \"&H7","v":". Стол. . "},{"$f":"K7","v":1},{"$f":"J7","v":""},{"$f":"L7","v":""}]
[]
{"$rows_left_out":42}
{"sheet":"Бланк ЗАКАЗА","index":1,"n_rows":48,"n_cols":33,"rows_kept":48,"cut":false,"hidden":false,"merged":[[52,0,52,8],[53,0,53,8],[46,41,46,42],[46,43,46,44],[46,45,46,46],[51,0,51,8],[51,9,51,10],[51,11,51,12],[51,13,51,14],[51,15,51,16],[51,17,51,18],[51,19,51,20],[51,21,51,22],[51,23,51,24],[51,25,51,26],[43,37,43,38],[43,39,43,40],[46,35,46,36],[46,37,46,38],[46,39,46,40],[15,0,15,6],[15,8,15,14],[15,17,15,23],[16,0,16,6],[16,8,16,14],[16,17,16,23],[6,0,6,1],[6,2,6,6],[6,11,6,13],[6,20,6,23],[9,0,9,1],[7,2,7,6],[7,8,7,9],[7,11,7,14],[7,17,7,22],[8,0,8,2],[8,4,8,6],[8,8,8,9],[8,11,8,14],[8,17,8,19],[8,20,8,22],[9,2,9,6],[0,0,0,2],[0,3,0,8],[0,9,2,24],[1,0,1,2],[1,3,1,4],[1,7,1,8],[2,4,2,8],[2,0,2,2],[3,21,3,23],[4,0,4,1],[5,0,5,1],[5,2,5,6],[5,8,5,9],[5,11,5,14],[5,17,5,19],[5,20,5,22],[3,0,3,4],[3,9,3,14],[3,17,3,20],[9,8,9,9],[9,11,9,14],[9,19,9,22],[10,0,10,1],[10,2,10,6],[10,8,10,14],[10,17,10,23],[11,0,11,1],[11,2,11,6],[11,8,11,11],[11,12,11,14],[11,17,11,19],[11,20,11,23],[12,2,12,6],[12,8,12,9],[12,11,12,13],[12,17,12,23],[13,1,13,6],[13,11,13,14],[13,17,13,20],[13,21,13,23],[14,1,14,6],[14,8,14,12],[14,13,14,14],[14,17,14,19],[14,20,14,23],[19,0,20,1],[19,17,19,23],[20,12,20,13],[17,0,17,1],[17,8,17,11],[17,12,17,14],[17,17,17,23],[18,17,18,23]]}
["Заказчик",null,null,null,null,null,null,null,null,"Внимание! Заказы принимаются только на оригинальных бланках \nЗаполнение каждого пункта бланка Обязательно!  \nВ случае не полного  заполнения бланка, заказ изготавливаться НЕ БУДЕТ!!!\n"]
["Заказ   №",null,null,null,null,"от",null,null,null,null,null,null,null,null,null,null,null,null,null,null,null,null,null,null,null,null,null,null,"№","Наименование","к-во","цена","сумма"]
["Дата отгрузки",null,null,null,null,null,null,null,null,null,null,null,null,null,null,null,null,null,null,null,null,null,null,null,null,null,null,null,1]
["Количество комплектов данной кухни",null,null,null,null,null,null,null,"Ручка",null,null,null,null,null,null,null,null,"Опора барной стойки",null,null,null,null,null,null,null,null,null,null,2]
["ТИП фасада",null,null,null,null,null,null,null,null,null,null,null,null,null,null,null,null,null,null,null,null,null,null,null,null,null,null,null,3,null,null,"",""]
["Цвет фасада",null,null,null,null,null,null,null,"Сверловка под ручку",null,null,null,null,null,null,null,null,"Багет 16\\",null,null,null,null,null,null,"шт",null,null,null,4,null,null,"",""]
["Фрезеровка",null,null,null,null,null,null,null,null,null,null,"(Горизонтально/вертикально)",null,null,null,null,null,null,null,null,"указать тип и цвет",null,null,null,null,null,null,null,5]
[null,null,"(под стекло:рамка с крестом/без креста)",null,null,null,null,null,"Опоры простые\\хром ",null,null,null,null,null,null,null,null,null,null,null,null,null,null,null,"шт",null,null,null,6]
{"$rows_left_out":41}
{"sheet":"Титул.лист","index":2,"n_rows":21,"n_cols":20,"rows_kept":21,"cut":false,"hidden":false,"merged":[[13,0,13,5],[18,1,18,6],[18,11,18,12],[7,4,7,10],[8,0,8,5],[8,9,8,14],[9,0,9,5],[9,9,9,14],[10,9,10,14],[19,1,19,6],[19,11,19,12],[20,1,20,6],[20,11,20,12],[10,0,10,5],[14,0,15,5],[14,9,14,14],[17,0,17,1],[17,2,17,3],[11,0,11,5],[11,9,11,14],[12,0,12,5],[12,9,12,14],[13,9,13,14],[17,11,17,12],[17,9,17,10]]}
[null,null,null,null,null,null,null,null,null,"ООО Форт г.Ульяновск",null,null,null,null,null,"Наценка"]
[null,null,null,null,null,null,null,null,null,"14 Инженерный проезд, д.7а",null,null,null,null,null,0]
[null,null,null,null,null,null,null,null,null,"тел./факс:8 (8422) 24-94-54, 24-94-41"]
[null,null,null,null,null,null,null,null,null,"www.fort-mebel.ru"]
[null,null,null,null,null,null,null,null,null,"Ваши предложения и пожелания sinerkin@yandex.ru "]
[null,null,null,null,null,null,null,null,null,"8 917-050-76-70  Линда egorova@fort-mebel.ru"]
[]
[null,null,null,null,"Базовая коплектация:"]
{"$rows_left_out":14}
{"sheet":"Столы","index":3,"n_rows":206,"n_cols":14,"rows_kept":206,"cut":false,"hidden":false,"merged":[[73,1,80,1],[98,1,104,1],[119,1,126,1],[144,1,145,1],[81,1,88,1],[65,1,72,1],[2,1,3,1],[4,1,6,1],[7,1,8,1],[9,1,13,1],[19,1,20,1],[30,1,34,1],[167,0,169,0],[167,1,175,1],[176,1,180,1],[181,1,182,1],[163,0,164,0],[157,1,158,1],[184,1,190,1],[191,1,197,1],[198,1,205,1],[153,1,155,1],[156,1,156,1]]}
[null,null,null,"Размер",null,"Код изделия","МДФ\nмат.","МДФ\nглян.","МДФ\nметалл.","МДФ+ПАТИНА","БАГЕТНАЯ","БОСТОН\nПВХ/фот.печ.","БОСТОН ЛАК","БОСТОН ЭМАЛЬ"]
["Столы под мойку"]
[null,"Стол под мойку 1дв.","Стол под мойку 1дв.",500,{"$f":"C3&\", размер: \"&D3","v":"Стол под мойку 1дв., размер: 500"},"1101-50",1500,1620,1660,{"$f":"0.000716*D3*3910+G3","v":2899.7799999999997},{"$f":"0.000716*D3*5010+G3","v":3293.58},{"$f":"0.000716*D3*3130+G3","v":2620.54},{"$f":"0.00072*D3*5110+G3","v":3339.6000000000004},{"$f":"0.00072*D3*8910+G3","v":4707.6000000000004}]
[null,null,"Стол под мойку 1дв.",600,{"$f":"C4&\", размер: \"&D4","v":"Стол под мойку 1дв., размер: 600"},"1101-60",1590,1740,1800,3269.7359999999999,{"$f":"0.000716*D4*5010+G4","v":3742.2959999999998},{"$f":"0.000716*D4*3130+G4","v":2934.6480000000001},{"$f":"0.00072*D4*5110+G4","v":3797.5200000000004},{"$f":"0.00072*D4*8910+G4","v":5439.1200000000008}]
[null,"Стол под мойку 2дв.","Стол под мойку 2дв.",500,"Стол под мойку 2дв., размер: 500","1102-50",1540.0000000000002,1660,1700,2939.78,3333.58,2660.54,3379.6000000000004,4747.6000000000004]
[null,null,"Стол под мойку 2дв.",600,"Стол под мойку 2дв., размер: 600","1102-60",1670,1810,1880,3349.7359999999999,3822.2959999999998,3014.6480000000001,3877.5200000000004,5519.1200000000008]
[null,null,"Стол под мойку 2дв.",800,"Стол под мойку 2дв., размер: 800","1102-80",2030,2220,2310,4269.6479999999992,4899.7280000000001,3822.864,4973.3600000000006,7162.1600000000008]
[null,"Стол под врезную мойку 1дв.","Стол под врезную мойку 1дв.",500,"Стол под врезную мойку 1дв., размер: 500","1105-50",2270,2400,2480,3669.7799999999997,4063.58,3390.54,4109.6000000000004,5477.6]
{"$rows_left_out":199}
{"sheet":"Шкафы","index":4,"n_rows":408,"n_cols":17,"rows_kept":408,"cut":false,"hidden":false,"merged":[[34,1,69,1],[34,2,69,2],[34,5,42,5],[43,5,51,5],[52,5,60,5],[61,5,69,5],[70,1,87,1],[70,2,87,2],[70,5,78,5],[79,5,87,5],[13,1,21,1],[13,2,21,2],[13,5,15,5],[16,5,18,5],[19,5,21,5],[22,1,24,1],[22,2,24,2],[23,5,24,5],[25,1,33,1],[25,2,33,2],[25,5,27,5],[28,5,30,5],[31,5,33,5],[2,1,8,1],[2,2,8,2],[2,5,4,5],[5,5,6,5],[7,5,8,5],[9,1,12,1],[9,2,12,2],[9,5,10,5],[11,5,12,5],[133,5,138,5],[139,5,145,5],[146,5,152,5],[153,1,158,1],[153,2,158,2],[153,5,155,5],[156,5,158,5],[94,5,99,5],[100,5,107,5],[108,5,115,5],[116,1,126,1],[116,2,126,2],[116,5,118,5],[119,5,122,5],[123,5,126,5],[159,1,177,1],[159,2,177,2],[159,5,163,5],[164,5,170,5],[171,5,177,5],[178,1,198,1],[178,2,198,2],[178,5,182,5],[183,5,190,5],[191,5,198,5],[199,1,218,1],[199,2,218,2],[199,5,207,5],[208,5,218,5],[233,1,238,1],[233,2,238,2],[233,5,234,5],[235,5,236,5],[237,5,238,5],[219,1,224,1],[219,2,224,2],[219,5,221,5],[222,5,224,5],[225,1,230,1],[225,2,230,2],[225,5,227,5],[228,5,230,5],[231,1,232,1],[231,2,232,2],[239,1,241,1],[239,2,241,2],[242,1,248,1],[242,2,251,2],[242,5,244,5],[245,5,248,5],[249,1,251,1],[249,5,251,5],[309,1,311,1],[309,2,311,2],[312,1,314,1],[312,2,314,2],[296,1,305,1],[296,2,305,2],[296,5,298,5],[299,5,302,5],[303,5,305,5],[306,1,308,1],[306,2,308,2],[365,1,378,1],[365,2,371,2],[365,5,371,5],[372,2,378,2],[372,5,378,5],[315,1,332,1],[315,2,332,2],[315,5,323,5],[324,5,332,5],[333,1,346,1],[333,2,339,2],[333,5,339,5],[340,2,346,2],[340,5,346,5],[393,2,395,2],[393,5,395,5],[396,2,398,2],[396,5,398,5],[399,1,404,1],[399,2,401,2],[399,5,401,5],[402,2,404,2],[402,5,404,5],[222,19,222,21],[88,5,93,5],[88,1,115,1],[88,2,115,2],[127,5,132,5],[127,2,152,2],[129,1,152,1],[405,1,407,1],[405,2,407,2],[379,1,386,1],[379,2,386,2],[379,5,382,5],[383,5,386,5],[387,1,392,1],[387,2,389,2],[387,5,389,5],[390,2,392,2],[390,5,392,5],[347,1,364,1],[347,2,355,2],[347,5,355,5],[356,2,364,2],[356,5,364,5],[393,1,398,1]]}
[null,null,null,null,"Размер","Высота  \nмодуля",null,null,"Код изделия","МДФ\nмат.","МДФ\nглян.","МДФ\nметалл.","МДФ+ПАТИНА","БАГЕТНАЯ","БОСТОН\nПВХ/фот.печ.","БОСТОН \nЛАК","БОСТОН \nЭМАЛЬ"]
[null,"Шкафы навесные "]
[null,null,"Шкаф под посудосушитель 1дв ","Шкаф под посудосушитель 1дв ",400,"h 600","h 600",{"$f":"D3&\", размер: \"&E3&\", \"&G3","v":"Шкаф под посудосушитель 1дв , размер: 400, h 600"},"1315-40",960,1030,1070,{"$f":"0.0006*E3*3910+J3","v":1898.4},{"$f":"0.0006*E3*5010+J3","v":2162.3999999999996},{"$f":"0.0006*E3*3130+J3","v":1711.1999999999998},{"$f":"0.0006*E3*5110+J3","v":2186.3999999999996},{"$f":"0.0006*E3*8910+J3","v":3098.4}]
[null,null,null,"Шкаф под посудосушитель 1дв ",500,null,"h 600",{"$f":"D4&\", размер: \"&E4&\", \"&G4","v":"Шкаф под посудосушитель 1дв , размер: 500, h 600"},"1315-50",1120,1220,1260,{"$f":"0.0006*E4*3910+J4","v":2293},{"$f":"0.0006*E4*5010+J4","v":2623},{"$f":"0.0006*E4*3130+J4","v":2059},{"$f":"0.0006*E4*5110+J4","v":2653},{"$f":"0.0006*E4*8910+J4","v":3793}]
[null,null,null,"Шкаф под посудосушитель 1дв ",600,null,"h 600","Шкаф под посудосушитель 1дв , размер: 600, h 600","1315-60",1280,1400,1440,2687.6,3083.6,2406.8000000000002,3119.6,4487.6000000000004]
[null,null,null,"Шкаф под посудосушитель 1дв ",500,"h 720","h 720","Шкаф под посудосушитель 1дв , размер: 500, h 720","1309-50",1290,1410,1450,{"$f":"0.000716*E6*3910+J6","v":2689.7799999999997},{"$f":"0.00072*E6*5010+J6","v":3093.6000000000004},{"$f":"0.00072*E6*3130+J6","v":2416.8000000000002},{"$f":"0.00072*E6*5110+J6","v":3129.6000000000004},{"$f":"0.00072*E6*8910+J6","v":4497.6000000000004}]
[null,null,null,"Шкаф под посудосушитель 1дв ",600,null,"h 720","Шкаф под посудосушитель 1дв , размер: 600, h 720","1309-60",1440,1590,1650.0000000000002,{"$f":"0.000716*E7*3910+J7","v":3119.7359999999999},{"$f":"0.00072*E7*5010+J7","v":3604.32},{"$f":"0.00072*E7*3130+J7","v":2792.16},{"$f":"0.00072*E7*5110+J7","v":3647.5200000000004},{"$f":"0.00072*E7*8910+J7","v":5289.1200000000008}]
[null,null,null,"Шкаф под посудосушитель 1дв ",500,"h 920","h 920","Шкаф под посудосушитель 1дв , размер: 500, h 920","1310-50",1630,1780,1850,{"$f":"0.000916*E8*3910+J8","v":3420.7799999999997},{"$f":"0.00092*E8*5010+J8","v":3934.6},{"$f":"0.00092*E8*3130+J8","v":3069.8},{"$f":"0.00092*E8*5110+J8","v":3980.6},{"$f":"0.00092*E8*8910+J8","v":5728.6}]
{"$rows_left_out":401}
{"sheet":"Пенал-полупеналы","index":5,"n_rows":95,"n_cols":17,"rows_kept":95,"cut":false,"hidden":false,"merged":[[0,2,0,8],[93,1,94,1],[93,2,94,2],[91,1,92,1],[91,2,92,2],[89,1,90,1],[89,2,90,2],[87,2,88,2],[79,1,81,1],[79,2,81,2],[79,5,81,5],[73,1,75,1],[73,2,75,2],[73,5,75,5],[76,1,78,1],[76,2,78,2],[76,5,78,5],[63,1,69,1],[63,2,69,2],[63,5,69,5],[70,1,72,1],[70,2,72,2],[70,5,72,5],[44,1,54,1],[44,2,49,2],[44,5,49,5],[50,2,54,2],[50,5,54,5],[56,1,62,1],[56,2,62,2],[56,5,62,5],[2,1,7,1],[2,2,7,2],[2,5,4,5],[5,5,7,5],[8,1,13,1],[8,2,13,2],[8,5,10,5],[11,5,13,5],[27,1,37,1],[27,2,32,2],[27,5,32,5],[33,2,37,2],[33,5,37,5],[38,1,43,1],[38,2,43,2],[38,5,43,5],[14,1,19,1],[14,2,19,2],[14,5,16,5],[17,5,19,5],[20,1,25,1],[20,2,25,2],[20,5,22,5],[23,5,25,5]]}
[null,null,null,null,null,null,null,null,null,"МДФ\nмат.","МДФ\nглян.","МДФ\nметалл.","МДФ+ПАТИНА","БАГЕТНАЯ","БОСТОН\nПВХ/фот.печ.","БОСТОН ЛАК","БОСТОН ЭМАЛЬ"]
[null,"Пеналы"]
[null,null,"Пенал 2140 без ящ 3дв ","Пенал 2140 без ящ 3дв ",400,"h 2140","h 2140",{"$f":"D3&\", размер: \"&E3&\", \"&G3","v":"Пенал 2140 без ящ 3дв , размер: 400, h 2140"},"1702-40",4170,4440,4550,{"$f":"0.00204*E3*3910+J3","v":7360.56},{"$f":"0.00204*E3*5010+J3","v":8258.16},{"$f":"0.00204*E3*3130+J3","v":6724.08},{"$f":"0.00204*E3*5110+J3","v":8339.76},{"$f":"0.00204*E3*8910+J3","v":11440.560000000001}]
[null,null,null,"Пенал 2140 без ящ 3дв ",500,null,"h 2140",{"$f":"D4&\", размер: \"&E4&\", \"&G4","v":"Пенал 2140 без ящ 3дв , размер: 500, h 2140"},"1702-50",4800,5140,5290,{"$f":"0.00204*E4*3910+J4","v":8788.2000000000007},{"$f":"0.00204*E4*5010+J4","v":9910.2000000000007},{"$f":"0.00204*E4*3130+J4","v":7992.6},{"$f":"0.00204*E4*5110+J4","v":10012.200000000001},{"$f":"0.00204*E4*8910+J4","v":13888.2}]
[null,null,null,"Пенал 2140 без ящ 3дв ",600,null,"h 2140","Пенал 2140 без ящ 3дв , размер: 600, h 2140","1702-60",5430,5840,6030,10215.84,11562.240000000002,9261.1200000000008,11684.640000000001,16335.840000000002]
[null,null,null,"Пенал 2140 без ящ 3дв ",400,"h 2340","h 2340","Пенал 2140 без ящ 3дв , размер: 400, h 2340","1703-40",{"$f":"J3*0.1+J3","v":4587},4884,5005,{"$f":"0.00224*E6*3910+J6","v":8090.36},{"$f":"0.00224*E6*5010+J6","v":9075.9599999999991},{"$f":"0.00224*E6*3130+J6","v":7391.48},{"$f":"0.00224*E6*5110+J6","v":9165.56},{"$f":"0.00224*8910*E6+J6","v":12570.359999999999}]
[null,null,null,"Пенал 2140 без ящ 3дв ",500,null,"h 2340","Пенал 2140 без ящ 3дв , размер: 500, h 2340","1703-50",{"$f":"J4*0.1+J4","v":5280},5654,5819,{"$f":"0.00224*E7*3910+J7","v":9659.2000000000007},{"$f":"0.00224*E7*5010+J7","v":10891.2},{"$f":"0.00224*E7*3130+J7","v":8785.5999999999985},{"$f":"0.00224*E7*5110+J7","v":11003.2},{"$f":"0.00224*8910*E7+J7","v":15259.199999999999}]
[null,null,null,"Пенал 2140 без ящ 3дв ",600,null,"h 2340","Пенал 2140 без ящ 3дв , размер: 600, h 2340","1703-60",5973,6424,6633,11228.039999999999,12706.439999999999,10179.719999999999,12840.84,17948.04]
{"$rows_left_out":88}
{"sheet":"Ручки","index":6,"n_rows":33,"n_cols":10,"rows_kept":33,"cut":false,"hidden":false,"merged":[[1,0,2,0],[3,0,7,0],[3,2,7,2],[10,0,12,0],[13,0,14,0],[13,1,14,1],[10,1,12,1],[23,0,24,0],[23,1,24,1],[23,3,24,3],[15,0,16,0],[15,1,16,1],[18,0,19,0],[18,1,19,1],[20,0,21,0]]}
[null,null,"название","цвет",null,"ДОПЛАТА к базовой",null,null,null,"Стоимость,шт."]
["БАЗА",null,"Рейлинг пластик 96 (базовая)"," хром",{"$f":"C2&\", \"&D2","v":"Рейлинг пластик 96 (базовая),  хром"},0,"Рейлинг пластик 96"," хром","25 руб\n(базовая)",25]
[null,null,"Ручка скоба 96 (базовая)","золото, хром",{"$f":"C3&\", \"&D3","v":"Ручка скоба 96 (базовая), золото, хром"},0,"Ручка скоба 96","золото, хром","25 руб\n(базовая)",25]
["БАЗА",null,"С-18 пластик,                                металл 96, 128, 160 мм","черный",null,0,null,null,null,25]
[null,null,null,"белый",null,0,null,null,null,25]
[null,null,null,"Ясень шимо св.",null,0,null,null,null,25]
[null,null,null,"клен",null,0,null,null,null,25]
[null,null,null,"ольха",null,0,null,null,null,25]
{"$rows_left_out":26}
{"sheet":"Витраж","index":7,"n_rows":1,"n_cols":10,"rows_kept":1,"cut":false,"hidden":false,"merged":[[0,0,1,7],[0,9,1,20]]}
["1 кат. - 2620 ",null,null,null,null,null,null,null,null,"2 кат. - 3740"]

{"sheet":"столешницы,козырьки,багеты","index":8,"n_rows":130,"n_cols":14,"rows_kept":130,"cut":false,"hidden":false,"merged":[[80,1,81,3],[80,4,80,6],[79,1,79,6],[1,8,1,14],[2,8,3,10],[2,11,2,13],[4,8,4,10],[5,8,5,10],[129,0,129,4],[109,0,113,0],[124,1,124,7],[125,1,125,7],[10,0,43,0],[56,1,56,6],[73,1,74,3],[73,4,73,6],[75,1,75,3],[76,1,76,3],[116,0,117,0],[48,1,49,3],[48,4,48,6],[47,1,47,6],[45,0,45,6],[50,4,51,4]]}
[]
[null,null,null,null,null,null,null,null,"Цена постформинга"]
[null,null,"Категория пластика(руб./п.м.)",null,null,null,null,null,"Толщина постформинга",null,null,"Категория пластика(руб./п.м.)"]
["Толщина постформинга","1ц.к.","2ц.к.","3ц.к.","Замена",null,null,null,null,null,null,"1 ц.к.","2ц.к.","3ц.к."]
[26,0,270,470,0,null,null,null,26,null,null,780,1050,1250]
["38в.",530,960,1240,0,null,null,null,"38в.",null,null,1310,1740,2020]
["При замене \nугловой 26 на 38в.",0,0,0,600]
[]
{"$rows_left_out":123}
{"sheet":"доп.хар+мойки","index":9,"n_rows":92,"n_cols":6,"rows_kept":92,"cut":false,"hidden":false,"merged":[[91,0,91,1],[79,0,79,1],[80,0,80,1],[81,0,81,1],[82,0,82,1],[83,0,83,1],[84,0,84,1],[86,0,86,1],[87,0,87,1],[88,0,88,1],[89,0,89,1],[90,0,90,1],[85,0,85,1],[78,0,78,1],[63,0,63,1],[63,9,63,10],[63,11,63,12],[64,0,64,1],[64,9,64,10],[64,11,64,12],[72,0,72,1],[73,0,73,1],[74,0,74,1],[75,0,75,1],[77,0,77,1],[66,0,66,1],[69,11,69,12],[66,9,66,10],[66,11,66,12],[54,11,54,12],[55,0,55,1],[57,0,57,1],[57,9,57,10],[57,11,57,12],[56,0,56,1],[34,0,35,5],[48,0,48,1],[49,0,49,1],[50,0,50,1],[51,0,51,1],[46,0,46,1],[45,0,45,1],[36,0,36,1],[37,0,37,1],[38,0,38,1],[39,0,39,1],[40,0,40,1],[41,0,41,1],[42,0,42,1],[43,0,43,1],[44,0,44,1],[59,11,59,12],[65,0,65,1],[65,9,65,10],[65,11,65,12],[60,0,60,1],[60,9,60,10],[60,11,60,12],[61,0,61,1],[61,9,61,10],[61,11,61,12],[62,0,62,1],[62,9,62,10],[62,11,62,12],[67,11,67,12],[76,0,76,1],[58,0,58,1],[58,9,58,10],[58,11,58,12],[70,0,70,1],[70,9,70,10],[70,11,70,12],[71,0,71,1],[71,9,71,10],[71,11,71,12],[68,0,68,1],[68,9,68,10],[68,11,68,12],[59,0,59,1],[59,9,59,10],[47,0,47,1],[69,0,69,1],[69,9,69,10],[67,0,67,1],[67,9,67,10],[54,9,54,10],[52,0,52,1],[53,0,53,1],[54,0,54,1]]}
["Мойки и посудосушители \nВНИМАНИЕ!!!ВЫРЕЗ ПОД МОЙКУ ПЛАТНЫЙ-?????руб.",null,"цена, руб"]
["Мойка 500  накладная",null,1100]
["Мойка 800 накладная",null,1400]
["Мойка 600 накладная ",null,1250]
["Мойка овал врезная \n50*77",null,1900]
["Посудосушитель 400 мм. ",null,176]
["Посудосушитель 500 мм.",null,186]
["Посудосушитель 600 мм.",null,215]
{"$rows_left_out":85}
{"sheet":"Материалы","index":10,"n_rows":163,"n_cols":18,"rows_kept":163,"cut":false,"hidden":false,"merged":[[155,0,161,1],[155,2,161,3],[155,4,161,5],[155,6,161,7],[155,8,161,9],[155,10,161,11],[155,12,161,13],[155,14,161,15],[162,0,169,1],[162,2,169,3],[162,4,169,5],[162,6,169,7],[153,0,154,15],[139,0,145,1],[139,2,145,3],[139,4,145,5],[139,6,145,7],[139,8,145,9],[139,10,145,11],[139,12,145,13],[139,14,145,15],[146,2,152,3],[146,0,152,1],[146,4,152,5],[146,6,152,7],[146,8,152,9],[146,10,152,11],[146,12,152,13],[146,14,152,15],[133,0,138,1],[133,2,138,3],[133,4,138,5],[133,6,138,7],[133,8,138,9],[133,10,138,11],[133,12,138,13],[133,14,138,15],[117,0,117,15],[118,4,120,5],[118,6,120,7],[121,4,126,5],[121,6,126,7],[127,4,132,5],[127,6,132,7],[118,0,120,1],[118,2,120,3],[121,0,126,1],[121,2,126,3],[127,0,132,1],[127,2,132,3],[118,14,120,15],[121,14,126,15],[127,14,132,15],[7,4,7,8],[8,0,8,12],[10,0,10,1],[10,2,10,3],[10,4,10,5],[10,6,10,7],[10,8,10,9],[10,10,10,11],[10,12,10,13],[12,10,12,11],[10,14,10,15],[11,0,11,1],[11,2,11,3],[11,4,11,5],[11,6,11,7],[11,8,11,9],[11,10,11,11],[11,12,11,13],[11,14,11,15],[12,0,12,1],[12,2,12,3],[12,4,12,5],[12,6,12,7],[12,8,12,9],[97,3,97,9],[99,0,99,15],[84,0,84,15],[25,0,25,15],[13,0,13,13],[14,2,14,12],[19,0,19,2],[20,0,20,15],[29,0,29,15],[32,0,32,15],[33,0,33,15],[35,3,35,5],[70,0,70,15],[90,3,90,9],[91,3,91,5],[91,6,91,8],[91,9,91,11],[93,3,93,5],[93,6,93,8],[93,9,93,11],[94,3,94,5],[94,6,94,8],[94,9,94,11],[101,0,101,1],[101,4,101,5],[101,8,101,9],[101,12,101,13],[102,0,102,1],[102,4,102,5],[102,8,102,9],[102,12,102,13],[100,0,100,15],[105,0,105,1],[105,4,105,5],[105,8,105,9],[105,12,105,13],[106,0,106,1],[106,4,106,5],[106,8,106,9],[106,12,106,13],[103,0,103,1],[103,4,103,5],[103,8,103,9],[103,12,103,13],[104,0,104,1],[104,4,104,5],[104,8,104,9],[111,0,111,1],[111,4,111,5],[111,8,111,9],[111,12,111,13],[112,0,112,1],[112,4,112,5],[112,8,112,9],[112,12,112,13],[107,0,107,1],[107,4,107,5],[108,0,108,15],[109,0,109,15],[110,0,110,1],[110,4,110,5],[110,8,110,9],[110,12,110,13],[116,0,116,1],[116,4,116,5],[113,0,113,15],[114,0,114,1],[114,4,114,5],[114,8,114,9],[114,12,114,13],[115,0,115,1],[115,4,115,5],[115,8,115,9],[115,12,115,13],[118,12,120,13],[121,12,126,13],[127,12,132,13],[118,8,120,9],[121,8,126,9],[127,8,132,9],[118,10,120,11],[121,10,126,11],[127,10,132,11]]}
[null,null,null,null,null,null,null,"ООО Форт г.Ульяновск"]
[null,null,null,null,null,null,null,"14 Инженерный проезд, д.7а"]
[null,null,null,null,null,null,null,"тел./факс:8 (8422) 24-94-54, 24-94-41"]
[null,null,null,null,null,null,null,"www.fort-mebel.ru"]
[null,null,null,null,null,null,null,"Ваши предложения и пожелания sinerkin@yandex.ru "]
[null,null,null,null,null,null,null,"8 917-050-76-70  Линда egorova@fort-mebel.ru"]
[]
[]
{"$rows_left_out":156}
{"sheet":"ФРЕЗЕРОВКИ","index":11,"n_rows":155,"n_cols":17,"rows_kept":155,"cut":false,"hidden":false,"merged":[[97,0,98,3],[97,4,98,7],[97,8,98,11],[97,12,98,15],[116,4,117,7],[116,8,117,11],[116,12,117,15],[116,16,117,19],[135,0,136,3],[135,4,136,7],[135,8,136,11],[135,12,136,15],[0,0,1,19],[23,0,24,19],[40,0,41,3],[40,4,41,7],[40,8,41,11],[40,12,41,15],[40,16,41,19],[137,0,138,18],[135,16,136,19],[154,0,155,3],[18,0,19,4],[18,5,19,9],[18,10,19,14],[18,15,19,19],[57,0,58,3],[62,0,63,19],[79,0,80,3],[79,4,80,7],[79,8,80,11],[79,12,80,15],[79,16,80,19],[97,16,98,19],[116,0,117,3]]}
["БАГЕТНАЯ СЕРИЯ"]
[]
[]
[]
[]
[]
[]
[]
{"$rows_left_out":148}
{"sheet":"ПЛИНТУС KORNER","index":12,"n_rows":44,"n_cols":13,"rows_kept":44,"cut":false,"hidden":false,"merged":[[0,0,0,14],[43,0,43,2],[33,3,41,5],[33,6,41,8],[33,9,41,11],[33,12,41,14],[43,3,43,5],[43,6,43,8],[43,9,43,11],[43,12,43,14],[31,0,31,2],[31,3,31,5],[31,6,31,8],[31,9,31,11],[31,12,31,14],[33,0,41,2],[22,9,30,11],[22,12,30,14],[20,0,20,2],[20,3,20,5],[20,9,20,11],[20,12,20,14],[20,6,20,8],[10,12,10,14],[1,9,9,11],[1,12,9,14],[12,0,19,2],[12,3,19,5],[12,6,19,8],[12,9,19,11],[12,12,19,14],[10,0,10,2],[10,3,10,5],[1,6,9,8],[1,3,9,5],[10,6,10,8],[10,9,10,11],[11,0,11,2],[11,3,11,5],[11,6,11,8],[11,9,11,11],[11,12,11,14],[32,0,32,2],[32,3,32,5],[32,6,32,8],[32,9,32,11],[32,12,32,14],[21,0,21,2],[21,3,21,5],[21,6,21,8],[21,9,21,11],[21,12,21,14],[22,0,30,2],[22,3,30,5],[22,6,30,8],[42,0,42,2],[42,3,42,5],[42,6,42,8],[42,9,42,11],[42,12,42,14]]}
["ПЛИНТУСА KORNER"]
[]
[]
[]
[]
[]
[]
[]
{"$rows_left_out":36}